rätt
type: Concept
narrower: krigsrätt
preferred label: oikeus (erikoisala) @fi
preferred label: law @en

krigsrätt
type: Concept
broader: rätt
in scheme: conceptscheme
preferred label: sotaoikeus @fi
preferred label: military law @en
scope note: Tarkoittaa oikeudenalaa. Sotatilan aikana asetetusta tuomioistuimesta käytä termiä sotatuomioistuimet
scope note: Avser rättsområde. Under krigstid användes termen krigsdomstolar