samhälleliga fenomen
type: Concept
narrower: livspolitik
preferred label: societal phenomena @en
preferred label: yhteiskunnalliset ilmiöt @fi

socialpolitik
type: Concept
preferred label: social policy @en
preferred label: sosiaalipolitiikka @fi
related: livspolitik

livspolitik
type: Concept
broader: samhälleliga fenomen
in scheme: conceptscheme
preferred label: elämänpolitiikka @fi
preferred label: life policy @en
related: socialpolitik
scope note: Politik som syftar till självförverkligande utifrån det dialektiska sambandet mellan det lokala och det globala samt framväxten av modernitetens internt referentiella system (Anthony Giddens)
scope note: Tarkoittaa yhteisiä, ryhmiä ja yhteiskuntaa koskevia ratkaisuja, joilla vaikutetaan ihmisten elämänkulkuun, mahdollisuuksiin, ihmissuhteisiin, itsensä toteuttamiseen, kurjuuteen ja hyvinvointiin (Anthony Giddens)