kertomukset (kulttuuriset tuotokset)
type: Concept
narrower: raamatunkertomukset

raamatunkertomukset
type: Concept
broader: kertomukset (kulttuuriset tuotokset)
in scheme: conceptscheme
preferred label: bible tales @en
preferred label: bibliska berättelser @sv
scope note: Tarkoittaa kertomuksia, jotka on muokattu Raamatusta tai joissa on aiheena jokin raamatunkertomus