electoral districts
type: Concept
source: Kielitoimiston sanakirja
comment: alue jollaisiin maa on jaettu vaaleja varten
broader: areas defined by human
in scheme: conceptscheme
preferred label: vaalipiirit @fi
preferred label: valkretsar @sv

areas defined by human
type: Concept
narrower: electoral districts
preferred label: områden definierade genom människans aktivitet @sv
preferred label: ihmisen määrittämät alueet @fi