matter
type: Concept
narrower: pitch
preferred label: aine @fi
preferred label: materia @sv

bitumen
type: Concept
preferred label: bitumi @fi
related: pitch

pitch
type: Concept
source: Kielitoimiston sanakirja
comment: puuta, turvetta, hartsia tm. org. yhdistettä tislattaessa syntyvä tumma jähmeä tislausjäännös
broader: matter
in scheme: conceptscheme
preferred label: beck @sv
preferred label: piki @fi
related: bitumen