teoriat (tuotokset)
type: Concept
narrower: spiritualismi (teologian)
preferred label: teorier (alster) @sv
preferred label: theories @en

spiritualismi (teologian)
type: Concept
comment: Teologiassa spiritualismi on näkemys, jonka mukaan yhteys Jumalaan on tärkeämpi kuin ulkoinen kirkko, Raamattu ja sakramentit
alternative label: spiritualismi
broader: teoriat (tuotokset)
in scheme: conceptscheme
preferred label: spiritualism (teologi) @en
preferred label: spiritualism @sv
scope note: Sanalla on monia merkityksiä. 1) Filosofiassa spiritualismi on oppi, jonka mukaan todellisuus on luonteeltaan henkistä. 2) Teologiassa spiritualismi on näkemys, jonka mukaan yhteys Jumalaan on tärkeämpi kuin ulkoinen kirkko, Raamattu ja sakramentit