tieteet (erikoisala)
type: Concept
narrower: metallioppi
preferred label: vetenskaper (forskningsområden) @sv
preferred label: sciences @en

metallioppi
type: Concept
source: Kielitoimiston sanakirja
comment: metallien ja metalliseosten ominaisuuksia tutkiva tiede
alternative label: metallografia
broader: tieteet (erikoisala)
in scheme: conceptscheme
preferred label: science of metals @en
preferred label: metallografi @sv