Mbuti people
type: Concept
broader: pygmies
preferred label: mbutit @fi
preferred label: mbuti @sv

Africans
type: Concept
narrower: pygmies
preferred label: afrikkalaiset @fi
preferred label: afrikaner @sv

pygmies
type: Concept
source: MOT Suomi 1.0a
comment: eräiden päiväntasaajan eteläpuolisessa Afrikassa ja Kaakkois-Aasiassa asuvien kääpiökansojen jäsen
broader: Africans
in scheme: conceptscheme
narrower: Mbuti people
preferred label: pygméer @sv
preferred label: pygmit @fi