profits
type: Concept
narrower: profits from selling property
preferred label: vinster @sv
preferred label: voitot @fi

profits from selling property
type: Concept
broader: profits
in scheme: conceptscheme
preferred label: överlåtelsevinster @sv
preferred label: luovutusvoitot @fi
scope note: Tarkoittaa omaisuuden luovutuksesta syntyvää voittoa. Luovutusvoitosta säädetään verolaissa