plats definierad genom människans aktivitet
type: Concept
narrower: fastigheter
preferred label: place defined by human @en
preferred label: ihmisen määrittämä paikka @fi

tomter
type: Concept
broader: fastigheter
preferred label: building sites @en
preferred label: tontit @fi

fastigheter
type: Concept
source: Kiinteistöliiketoiminnan sanasto
comment: Lainsäädännössä kiinteistöllä tarkoitetaan kiinteistörekisteriin kiinteistönä merkittyä maa- tai vesialueen omistuksen yksikköä.Kiinteistöön kuuluvat sillä sijaitsevat kiinteistön omistajan omistamat rakennukset ja kiinteät laitteet. (Ks. Kiinteistörekisterilaki ja Kiinteistönmuodostumislaki.) Sanaa kiinteistö käytetään puhekielessä yleisesti mm. pelkästä rakennuksesta.
broader: plats definierad genom människans aktivitet
in scheme: conceptscheme
narrower: tomter
preferred label: kiinteistöt @fi
preferred label: real estates @en