käräjäkunnat
type: Concept
part of: tuomiokunnat (alueet)
preferred label: tingslag @sv
preferred label: rural court districts @en

tuomiokunnat (alueet)
type: Concept
source: www.finlex.fi
part of: käräjäkunnat
comment: Oikeudenkäymiskaaren 2 luvun 1 §:n mukaan kihlakunnanoikeuden tuomiopiirinä on käräjäkunta. Käräjäkuntaan voi kuulua yksi tai useampia kuntia. Yksi tai useampi käräjäkunta puolestaan muodostaa tuomiokunnan.
alternative label: tuomiokunnat
broader: ihmisen määrittämät alueet
in scheme: conceptscheme
preferred label: judicial districts @en
preferred label: domsagor (områden) @sv

ihmisen määrittämät alueet
type: Concept
narrower: tuomiokunnat (alueet)
preferred label: områden definierade genom människans aktivitet @sv
preferred label: areas defined by human @en