byggnader
type: Concept
narrower: Haus Molchow
preferred label: buildings @en
preferred label: rakennukset @fi

Haus Molchow
type: Concept
broader: byggnader
in scheme: conceptscheme
scope note: Eliel Saarisen ja Herman Geselliuksen suunnittelema asuinrakennus Alt Ruppinissa Brandenburgissa Saksassa; purettu 1950-luvulla