biomaterials
type: Concept
narrower: bioplastic
preferred label: biomaterial @sv
preferred label: biomateriaalit @fi

bioplastic
type: Concept
broader: biomaterials
broader: plastic
in scheme: conceptscheme
preferred label: biomuovi @fi
preferred label: bioplast @sv
scope note: Tarkoittaa esim. bakteerien ja biojätteiden yhteistuloksena tehtyä muovia

plastic
type: Concept
narrower: bioplastic
preferred label: plast @sv
preferred label: muovi @fi