värmesystem
type: Concept
narrower: elvärme
preferred label: heating systems @en
preferred label: lämmitysjärjestelmät @fi

elvärme
type: Concept
source: Energiasanasto TSK 16
comment: sähkövastuksessa lämmöksi muutettuun sähköenergiaan perustuva lämmitysjärjestelmä
alternative label: eluppvärmning
broader: värmesystem
in scheme: conceptscheme
preferred label: sähkölämmitys @fi
preferred label: electric heating @en