andra världskriget
type: Concept
preferred label: second world war @en
preferred label: toinen maailmansota @fi
related: slaget vid Kursk

slaget vid Kursk
type: Concept
broader: strider
in scheme: conceptscheme
preferred label: Battle of Kursk @en
preferred label: Kurskin taistelu @fi
related: andra världskriget
scope note: Saksalaisten ja neuvostoliittolaisten välinen taistelu Neuvostoliitossa vuonna 1943

strider
type: Concept
narrower: slaget vid Kursk
preferred label: battles @en
preferred label: taistelut @fi