alteration of person's status
type: Concept
narrower: liberation
preferred label: ändrande av en persons status @sv
preferred label: henkilön aseman muuttaminen @fi

liberation process
type: Concept
preferred label: vapautuminen @fi
preferred label: frigörelse @sv
related: liberation

liberation
type: Concept
source: Suomen kielen perussanakirja
comment: 1) päästää tai saattaa vapaaksi ulkoisesta pakosta tai jonkun vallasta, saattaa joku riippumattomaksi; 2) päästää tai saattaa joku vapaaksi jostakin sidonnaisuudesta, sitoumuksesta, velvollisuudesta tms.; 3) päästää tai saattaa joku vapaaksi sidoksista, vankeudesta tms., päästää irti, irralleen; päästää (esteet raivaamalla) vapaaksi toimimaan, lähtemään tms.; 4) päästää tai jättää jokin varaamattomaksi, joutilaaksi, tyhjäksi, muuhun käyttöön
broader: alteration of person's status
in scheme: conceptscheme
preferred label: vapautus @fi
preferred label: befrielse @sv
related: liberation process