sävellykset
type: Concept
narrower: kaanonit (sävellykset)
preferred label: compositions @en
preferred label: kompositioner @sv

kaanonit (sävellykset)
type: Concept
source: Lähde: Suomen kielen perussanakirja; CD-Facta
comment: musiikissa moniääninen sävellysmuoto, jossa sama teema alkaa uudessa äänessä ennen kuin se on päättynyt toisessa.
alternative label: kaanonit
alternative label: kanonit
broader: sävellykset
in scheme: conceptscheme
preferred label: canons @en
preferred label: kanon (musik) @sv
scope note: Termen har många betydelser. Den används för 1) samling av heliga skrifter 2) musikstycke 3) stor tryckstil 4) centrala verk inom kultur eller konst t.ex. i ett visst land . För artilleripjäs används kanoner. @sv
scope note: Sanalla on monia merkityksiä. 1) Uskonnossa kaanon voi olla pyhien kirjojen kokoelma, kirkolliskokouksen tai paavin säädös, katolisen kirkon pyhimysluettelo tai ortodoksinen liturginen runoelma. 2) Kuvataiteissa ihmisruumiin ihanteellisten mittasuhteiden säännöt. 3) Musiikissa moniääninen sävellysmuoto, jossa sama teema alkaa uudessa äänessä ennen kuin se on päättynyt toisessa. 4) Kirjallisuudenhistoriassa yleisesti hyväksytyt teokset. 5) Kirjapainoalalla eräs iso kirjasinkoko