creation by placing
type: Concept
narrower: framing
preferred label: placerande skapande @sv
preferred label: paikalleen laittava luonti @fi

frames
type: Concept
preferred label: ramar @sv
preferred label: kehykset @fi
related: framing

framing
type: Concept
source: Suomen kielen perussanakirja
comment: 1) varustaa kehyksillä, panna kehyksiin; 2) olla kehyksenä jonkin ympärillä, ympäröidä, reunustaa
broader: creation by placing
in scheme: conceptscheme
preferred label: kehystys @fi
preferred label: inramning @sv
related: frames