ekonomiska fenomen
type: Concept
narrower: business intelligence
preferred label: economic phenomena @en
preferred label: taloudelliset ilmiöt @fi

business intelligence
type: Concept
broader: ekonomiska fenomen
in scheme: conceptscheme
related: kunskapshantering
scope note: Tarkoittaa kaikkea sellaista organisaation sisäisen ja ulkoisen tiedon hallintaa, jota tarvitaan organisaation liiketoiminnan johtamiseen sekä päivittäisten ratkaisujen tekemiseen. Lyhyesti määriteltynä tarkoittaa yrityksen tietämystä liiketoimintaympäristöstään

kunskapshantering
type: Concept
preferred label: knowledge management @en
preferred label: tietämyksenhallinta @fi
related: business intelligence