aine
type: Concept
narrower: faasit
preferred label: matter @en
preferred label: materia @sv

aineen olomuodot
type: Concept
preferred label: states of aggregation @en
preferred label: aggregationstillstånd @sv
related: faasit

faasit
type: Concept
source: Biologian sanakirja
comment: kemiallisen tai fysikaalisen systeemin muutos tai siinä havaittava erillinen homogeeninen alue
broader: aine
in scheme: conceptscheme
preferred label: faser @sv
preferred label: phases (chemistry) @en
related: aineen olomuodot

aine rakenteen mukaan
type: Collection
member: faasit
preferred label: ämne enligt struktur @sv