järjestetty tapahtuma
type: Concept
narrower: vastaanotto (järjestetty tapahtuma)
preferred label: arranged event @en
preferred label: ordnad händelse @sv

vastaanotto (järjestetty tapahtuma)
type: Concept
source: Kielitoimiston sanakirja
comment: juhlallinen tilaisuus, jossa otetaan vastaan vieraita, audienssi
alternative label: reseptio
alternative label: vastaanotto
broader: järjestetty tapahtuma
in scheme: conceptscheme
preferred label: reception @en
preferred label: audiens @sv