priser
type: Concept
narrower: internpriser
preferred label: prices @en
preferred label: hinnat @fi

internpriser
type: Concept
broader: priser
in scheme: conceptscheme
preferred label: siirtohinnat @fi
preferred label: transfer prices @en
scope note: Pris som används i företags interna fakturering mellan avdelningar, fabriker eller koncernföretag