religious communities
type: Concept
preferred label: religiösa samfund @sv
preferred label: uskonnolliset yhteisöt @fi
narrower: Jacobites

Jacobites
type: Concept
preferred label: syrisk-ortodoxa kyrkan @sv
preferred label: jakobiitit @fi
in scheme: conceptscheme
broader: religious communities
alternative label: West Syrian Rite
alternative label: jakobiter (kyrkosamfund) @sv
scope note: Perustajansa Jakob Baradaeuksen mukaan nimensä saanut monofysiittinen kirkkokunta.Nykyisin jakobiittejä on lähinnä Syyriassa ja Irakissa