hatbrott
type: Concept
broader: brott (juridik)
scope note: Hatbrott är inte i sig en brottsrubricering utan en samlande beteckning på brott där det i motivet funnits ett tydligt hat mot det som offret i gärningsmannens ögon representerade.
in scheme: conceptscheme
preferred label: hate crimes @en
preferred label: viharikokset @fi

brott (juridik)
type: Concept
preferred label: crimes @en
preferred label: rikokset @fi
narrower: hatbrott