equalisation
type: Concept
comment: 1) tehdä jokin pinta tai reuna profiililtaan tasaiseksi; 2) saattaa pinnan kohoumat tm. epätasaisuudet samaan tasoon ympäristönsä kanssa, silottaa; 3) poistaa erot, epätasaisuudet eri esineiden, kohtien tms. väliltä, yhtenäistää, samankaltaistaa, homogeenistaa; saattaa tasaisesti jakautuvaksi; 4) vakaannuttaa, tyynnyttää, hillitä, rauhoittaa 5) jakaa, panna tasan
preferred label: utjämning @sv
preferred label: tasaus @fi
source: Suomen kielen perussanakirja
broader: change by organizing
narrower: balancing of loss
in scheme: conceptscheme

change by organizing
type: Concept
preferred label: organiserande förändring @sv
preferred label: järjestävä muuttaminen @fi
narrower: equalisation

balancing of loss
type: Concept
preferred label: förlustutjämning @sv
preferred label: tappiontasaus @fi
broader: equalisation