förvandling
type: Concept
preferred label: alteration @en
preferred label: toisenlaiseksi muuttaminen @fi
narrower: eugenik

eugenik
type: Concept
preferred label: eugenics @en
preferred label: eugeniikka @fi
alternative label: rashygien
alternative label: rotuhygienia @fi
in scheme: conceptscheme
source: Biologian sanakirja
broader: förvandling
comment: ihmisen perimään kohdistuva vaikuttaminen ja sen tutkiminen; tarkoituksena on parantaa tulevien ihmissukupolvien fyysisiä tai henkisiä geneettisiä ominaisuuksia