patient documents
preferred label: potilasasiakirjat @fi
preferred label: patientdokument @sv
type: Concept
related: referrals

referrals
preferred label: remisser @sv
preferred label: lähetteet @fi
in scheme: conceptscheme
broader: documents
related: patient documents
type: Concept
comment: 1) asiakirjaa tm. lähetystä seuraava (lomakkeelle laadittu) tiedonanto, saate; asiakirja jolla potilas lähetetään jatkotutkimuksiin tai hoidettavaksi; 2) (teletekn.) lähetetty signaali
source: Suomen kielen perussanakirja

documents
preferred label: handlingar @sv
preferred label: asiakirjat @fi
type: Concept
narrower: referrals