aatteet
preferred label: tankar (idéer) @sv
preferred label: ideas @en
type: Concept
narrower: formalismi (aatteet)

formalismi (aatteet)
preferred label: formalism @en
preferred label: formalism (filosofi) @sv
alternative label: formalismi
comment: (fil.) loogista rakennetta korostava suuntaus
type: Concept
broader: aatteet
source: Kielitoimiston sanakirja
in scheme: conceptscheme