träning (av andra)
preferred label: coaching @en
preferred label: valmennus @fi
type: Concept
narrower: jobbrotation

jobbrotation
broader: träning (av andra)
preferred label: vaihtovalmennus @fi
preferred label: job rotation @en
scope note: Vaihtovalmennuksessa työntekijä lähtee jatkokoulutukseen ja hänen tilalleen tulee tehtävään valmennettu työtön
scope note: Jobbrotation innebär att en arbetstagare får vidareutbildning och under den tiden anställs en arbetslös yrkeskunnig person som ersättare.
related: sysselsättning (åtgärder)
type: Concept
in scheme: conceptscheme

sysselsättning (åtgärder)
preferred label: integration into working life @en
preferred label: työllistäminen @fi
type: Concept
related: jobbrotation