vetenskaper (forskningsområden)
preferred label: tieteet (erikoisala) @fi
preferred label: sciences @en
type: Concept
narrower: bibliografi (forskning)

bibliografi (forskning)
preferred label: bibliography @en
preferred label: bibliografia (erikoisala) @fi
comment: kirjallisuustieteen haara, jonka tehtävänä on kirjojen luettelointi
broader: vetenskaper (forskningsområden)
source: MOT Suomi 1.0a
type: Concept
in scheme: conceptscheme
alternative label: bibliografi