överförande av ägande
preferred label: transfer of ownership @en
preferred label: omistuksen siirtäminen @fi
type: Concept
narrower: beslag (juridik)

tvångsmedel
preferred label: coercive means @en
preferred label: pakkokeinot @fi
type: Concept
related: beslag (juridik)

beslag (juridik)
broader: överförande av ägande
preferred label: takavarikko @fi
preferred label: sequestration @en
comment: viranomaisen toimenpide, jolla tietty esine t. omaisuuserä erotetaan omistajan t. haltijan määräämisvallasta
in scheme: conceptscheme
source: Kielitoimiston sanakirja
related: tvångsmedel
alternative label: beslag -- juridik
type: Concept