muodonvaihdos
preferred label: metamorfos (biologi) @sv
preferred label: metamorphosis @en
type: Concept
related: metamorfoosi

muutos
preferred label: change @en
preferred label: förändring @sv
type: Concept
narrower: metamorfoosi

metamorfoosi
source: Suomen kielen perussanakirja
alternative label: muodonmuutos
comment: 1) tarina joka kertoo ihmisen muuttumisesta tav. eläimeksi tai kasviksi; 2) (geol.) kivilajien muuttuminen kivimassojen liikkeen, paineen tai lämpötilan vaikutuksesta; 3) (el.) muodonvaihdos; 4) (kasv.) muuntuminen
preferred label: metamorphosis @en
preferred label: metamorfos @sv
related: muodonvaihdos
in scheme: conceptscheme
broader: muutos
type: Concept