rättsjämförelse
in scheme: conceptscheme
broader: jämförelse
related: komparativ rätt
preferred label: oikeusvertailu @fi
preferred label: comparative law analysis @en
scope note: Redogörelse där man i praktiken jämför två eller flere länders lagar och förordningar.
scope note: Tarkoittaa käytännöllisluonteista selvitystyötä, jossa vertaillaan kahden tai useamman maan säädöksiä
type: Concept

jämförelse
preferred label: comparison @en
preferred label: vertailu @fi
type: Concept
narrower: rättsjämförelse

komparativ rätt
preferred label: vertaileva oikeustiede @fi
preferred label: comparative jurisprudence @en
type: Concept
related: rättsjämförelse