parts of the body
preferred label: kroppsdelar @sv
preferred label: ruumiinosat @fi
type: Concept
narrower: elbows

hands
preferred label: händerna @sv
preferred label: kädet @fi
type: Concept

elbows
preferred label: armbågarna @sv
preferred label: kyynärpäät @fi
broader: parts of the body
part of: hands
type: Concept
source: MOT Lääketiede 2.0a
comment: olkavarren ja kyynärvarren muutaman senttimetrin pituinen liittymäalue
in scheme: conceptscheme