rakennukset
preferred label: buildings @en
preferred label: byggnader @sv
type: Concept
narrower: Vattihuusi

Vattihuusi
broader: rakennukset
source: Lähde: MoNArch : selected seminar papers 1999-2000
scope note: Vattihuusi on C. L. Engelin v. 1829 suunnittelema puutalo Oulussa. Talo on alunperin toiminut vaivaistalona, myöhemmin kouluna
alternative label: Fattighus
in scheme: conceptscheme
preferred label: Fattighuset i Uleåborg @sv
type: Concept