talousrikokset
preferred label: economic crimes @en
preferred label: ekonomisk brottslighet @sv
type: Concept
related: organisaatiorikokset

organisaatiorikokset
preferred label: insiderbrott @sv
related: talousrikokset
source: Lähde: Encyclopaedia iuridica Fennica. 4
scope note: Organisaatio- eli yhteisörikollisuudella tarkoitetaan sellaista rikollisuutta, joka edellyttää rikoksenteon taustaksi itsenäisen organisaation olemassaolon. Organisaatiorikollisuus on puhtaan yksilörikollisuuden vastakohta. Organisaatiolla tarkoitetaan tässä yhteydessä erityisesti talouselämän ja julkisen vallan organisaatioita. Tässä mielessä suurin osa talousrikoksista on organisaatiorikoksia
in scheme: conceptscheme
type: Concept
broader: rikokset

rikokset
preferred label: brott (juridik) @sv
preferred label: crimes @en
type: Concept
narrower: organisaatiorikokset