samhälleliga alster
preferred label: societal accomplishments @en
preferred label: yhteiskunnalliset tuotokset @fi
type: Concept
narrower: respons

biofeedback
preferred label: biopalaute @fi
type: Concept
related: respons

respons
comment: 1) jonkin toimenpiteen, viestin tms. aiheuttama kannanilmaus tai reaktio; 2) itsesäätöisen järjestelmän reaktio johonkin, minkä järjestelmä on itse tuottanut
related: biofeedback
source: Suomen kielen perussanakirja
broader: samhälleliga alster
in scheme: conceptscheme
preferred label: feedback @en
preferred label: palaute @fi
type: Concept