kemi
preferred label: chemistry @en
preferred label: kemia @fi
type: Concept
narrower: grön kemi

grön kemi
broader: kemi
scope note: Tarkoittaa vaarallisten tai haitallisten aineiden käytön vähentämistä kemiallisissa tuotteissa tai prosesseissa
in scheme: conceptscheme
preferred label: vihreä kemia @fi
preferred label: green chemistry @en
type: Concept