Haikko
scope note: Kartano ja entinen rälssisäteri Porvoon maalaiskunnassa
type: Concept
preferred label: Haiko @sv
preferred label: Haikko manor @en
alternative label: Haikon kartano
broader: kartanot
in scheme: conceptscheme

kartanot
preferred label: herrgårdar @sv
preferred label: manors @en
type: Concept
narrower: Haikko