herrgårdar
preferred label: manors @en
preferred label: kartanot @fi
type: Concept
narrower: Gerknäs

Gerknäs
broader: herrgårdar
scope note: Kartano Lohjalla (aik. Lohjan kunnassa). Kylää tarkoitettaessa käytä Lohja -- Kirkniemi
in scheme: conceptscheme
preferred label: Kirkniemi manor @en
preferred label: Kirkniemi @fi
type: Concept