matter
preferred label: aine @fi
preferred label: materia @sv
type: Concept
narrower: forest litter

forest litter
preferred label: förna @sv
preferred label: karike @fi
type: Concept
broader: matter
comment: detritus: hajaantunut aines, eloperäinen jäte; ekologiassa merkitsee kuolleiden eläinten ja kasvien hajoamistuotteita ja -jätteitä maaperässä (karikkeessa) ja vesistöjen pohjilla
source: Biologian sanakirja
in scheme: conceptscheme