herrgårdar
preferred label: manors @en
preferred label: kartanot @fi
type: Concept
narrower: Sundsberg

Sundsberg
comment: viittaa kartanoon, kylään viittattaisiin asiasanaketjulla Kirkkonummi -- Sundsberg
scope note: Kartano ja kylä Kirkkonummella
broader: herrgårdar
type: Concept
in scheme: conceptscheme
preferred label: Sundsberg manor @en