ulkoiset ominaisuudet
preferred label: external properties @en
preferred label: yttre egenskaper @sv
type: Concept
narrower: itsenäisyys (vallasta)

itsenäisyys (vallasta)
comment: itsenäinen: tois(t)en vallasta, holhouksesta, avusta tms. riippumaton
source: Kielitoimiston sanakirja
in scheme: conceptscheme
preferred label: självständighet @sv
preferred label: independence @en
broader: ulkoiset ominaisuudet
type: Concept
alternative label: itsenäisyys