språk (typer)
preferred label: kielet (asema tai alkuperä) @fi
preferred label: languages @en
type: Concept
narrower: orientaliska språk

orientaliska språk
broader: språk (typer)
scope note: Tarkoittaa lähinnä Aasiassa puhuttuja kieliä
in scheme: conceptscheme
preferred label: itämaiset kielet @fi
preferred label: oriental languages @en
type: Concept