Kronstadt rebellion
broader: rebellion
scope note: Kapina bolsevikkeja vastaan v. 1921 Venäjällä
in scheme: conceptscheme
preferred label: Kronstadtupproret @sv
preferred label: Kronstadtin kapina @fi
type: Concept

rebellion
preferred label: kapinat @fi
preferred label: uppror @sv
type: Concept
narrower: Kronstadt rebellion