komissio
scope note: Tarkoittaa omissa nimissä mutta toisen lukuun käytyä kauppaa
broader: kauppa
type: Concept
in scheme: conceptscheme
preferred label: commission @en
preferred label: kommission (avtal) @sv
alternative label: kommission @sv
alternative label: komissiokauppa

kauppa
preferred label: trade @en
preferred label: handel @sv
type: Concept
narrower: komissio