FN:s världsdecennium för kulturell utveckling
broader: samhällelig tidsperiod
scope note: Utropades av Förenta nationerna för åren 1988-1998
scope note: Yhdistyneiden kansakuntien julistama vuosikymmen 1988-1997
in scheme: conceptscheme
preferred label: World Decade for Cultural Development @en
preferred label: Maailman kulttuurikehityksen vuosikymmen @fi
type: Concept

samhällelig tidsperiod
preferred label: societal period of time @en
preferred label: yhteiskunnallinen ajanjakso @fi
type: Concept
narrower: FN:s världsdecennium för kulturell utveckling