dramaturgi
in scheme: conceptscheme
preferred label: dramaturgia @fi
preferred label: dramaturgy @en
source: Kielitoimiston sanakirja
type: Concept
broader: vetenskaper (forskningsområden)
comment: draaman estetiikka, näytelmäteoria, näytelmätiede

vetenskaper (forskningsområden)
preferred label: tieteet (erikoisala) @fi
preferred label: sciences @en
type: Concept
narrower: dramaturgi