lingua franca (medeltida allmänspråk)
preferred label: lingua franca @en
preferred label: lingua franca (yleiskieli keskiajalla) @fi
comment: Keskiajalla Välimeren alueen yleiskieli, joka perustui italiaan ja jossa oli lisäksi aineksia mm. arabiasta ja kreikasta.
in scheme: conceptscheme
scope note: Sanalla on kaksi merkitystä. 1) Keskiajalla Välimeren alueen yleiskieli, joka perustui italiaan ja jossa oli lisäksi aineksia mm. arabiasta ja kreikasta. 2) Eri yhteisöjen yhteiseksi kieleksi esim. kaupankäynnissä, uskonnossa ja opetuksessa muodostunut kieli, kuten keskiajan latina; nykyään esim. arabia ja englanti
source: Lähde: Turtia, K. Sivistyssanat
type: Concept
broader: språk (typer)

språk (typer)
preferred label: kielet (asema tai alkuperä) @fi
preferred label: languages @en
type: Concept
narrower: lingua franca (medeltida allmänspråk)