numerologi
type: Concept
in scheme: conceptscheme
alternative label: talsymbolik
alternative label: lukumystiikka @fi
alternative label: lukusymboliikka @fi
alternative label: talmystik
preferred label: numerologia @fi
preferred label: numerology @en
broader: ockultism
comment: oppi numerojen maagisista ominaisuuksista
source: Kielitoimiston sanakirja

ockultism
preferred label: occultism @en
preferred label: okkultismi @fi
type: Concept
narrower: numerologi